{"text_format":"1","workbook":"xlsx","n_sheets":5,"sheets":["Bedingungen","Frontend","Calc","Änderungshistorie","Test"],"not_rendered":{"charts":0,"images":10,"macros":1,"external_links":0,"defined_names":0,"comments":0,"pivot_tables":0},"unopened":[],"bounds":{"document_bytes":16777216,"sheet_cells":100000,"rows_first":2000,"rows_last":500,"rows_between":2000,"halvings":0,"cell_chars":16384,"cell_head_chars":4096},"cells_cut":0,"cells_raw":0,"read":"whole","date_system":"1900"}

{"sheet":"Bedingungen","index":0,"n_rows":38,"n_cols":23,"rows_kept":38,"cut":false,"hidden":false,"merged":[[3,1,3,23],[4,1,4,23],[1,1,1,21],[37,1,37,13],[31,14,34,22]]}
[]
[null,"Bei erstmaliger Nutzung dieser Datei: Bitte bestätigen Sie die oberhalb gezeigte Sicherheitswarnung durch klicken von [Inhalt aktivieren] und akzeptieren Sie die dann erscheinende Sicherheitswarnung zu Makros"]
[]
[null,"Ermittlung der erforderlichen Schornsteinhöhen über Dachkante"]
[null,"nach den neuen Ableitbedingungen für Abgase - gütig ab 1. Januar 2022"]
[null,"1. BImSchV - §19 Verordnung über kleine und mittlere Feuerungsanlagen"]
[]
[]
[]
[]
[]
[]
[]
[]
[]
[]
[]
[]
[]
[]
[]
[]
[]
[]
[]
[]
[]
[]
[]
[]
[]
[]
[]
[]
[]
[]
[]
[null,null,null,null,null,null,null,null,null,null,null,null,null,null,null,null,null,"Support-Code",null,null,null,null,{"$f":"Frontend!AG30","v":"Version: 2.6 / 10.08.2022"}]

{"sheet":"Frontend","index":1,"n_rows":30,"n_cols":33,"rows_kept":30,"cut":false,"hidden":true,"merged":[[18,18,20,31],[23,1,23,5],[24,1,24,5],[29,1,29,26],[26,1,26,5],[18,15,18,16],[18,12,18,14],[18,2,18,11],[27,1,27,5],[19,1,19,16],[20,1,20,16],[16,12,16,14],[15,2,15,9],[12,12,12,14],[12,2,12,9],[13,2,13,14],[14,12,14,14],[14,2,14,9],[15,12,15,14],[16,2,16,10],[14,16,14,18],[15,16,15,18],[1,1,1,23],[2,1,2,23],[10,12,10,14],[10,2,10,9],[8,16,8,18],[10,16,10,18],[12,16,12,18],[11,2,11,14]]}
[]
[null,"Ermittlung der erforderlichen Schornsteinhöhen über Dachkante"]
[null,{"$f":"IF(Calc!F11=\"Flachdach\",\"nach VDI 3781 Blatt 4 - Satz 6.2.1.2.3\",\"nach den neuen Ableitbedingungen für Abgase - gültig ab 1. Januar 2022\")","v":"nach den neuen Ableitbedingungen für Abgase - gültig ab 1. Januar 2022"}]
[null,{"$f":"IF(Calc!F11=\"Flachdach\",\"\",\"1. BImSchV - §19 Verordnung über kleine und mittlere Feuerungsanlagen\")","v":"1. BImSchV - §19 Verordnung über kleine und mittlere Feuerungsanlagen"}]
[]
[null,"Bitte geben Sie die Dachform an:"]
[]
[]
[null,null,null,null,null,null,null,null,null,null,null,"Einheit",null,null,null,null,{"$f":"IF(M11=\"\",\"\",\"Ihre Eingabe in cm\")","v":""}]
[]
[null,"D","Dachbreite",null,null,null,null,null,null,null,null,{"$f":"IF(B11=\"\",\"\",\"mm\")","v":"mm"},null,null,null,null,{"$f":"IF(M11=\"\",\"\",M11/10)","v":""}]
[null,null,{"$f":"IF(Calc!F11=\"Flachdach\",\"Es ist die schmalere Hausseite anzugeben!!!\",\"\")","v":""}]
[null,{"$f":"IF(Calc!F11=\"Flachdach\",\"\",\"N\")","v":"N"},{"$f":"IF(B13=\"\",\"\",\"Dachneigung\")","v":"Dachneigung"},null,null,null,null,null,null,null,null,{"$f":"IF(B13=\"\",\"\",\"°\")","v":"°"},null,null,null,{"$f":"IF(M13=\"\",\"\",IF(M13>Calc!C4,\"û\",\"ü\"))","v":""}]
[null,null,{"$f":"IF(M13>Calc!C4,\"Die maximale Dachneigung darf 65° nicht überschreiten\",IF(M13=\"\",\"\",IF(M13<20,\"Die Berechnung erfolgt unter der Annahme einer Dachneigung von 20° (gestrichelte Linie)!\",\"\")))","v":""}]
[null,{"$f":"IF(Calc!F11=\"Flachdach\",\"\",\"A\")","v":"A"},{"$f":"IF(B15=\"\",\"\",\"Abstand First - Mittellinie Schornstein\")","v":"Abstand First - Mittellinie Schornstein"},null,null,null,null,null,null,null,null,{"$f":"IF(B15=\"\",\"\",\"mm\")","v":"mm"},null,null,null,{"$f":"IF(M15=\"\",\"\",IF(M15>M16,\"û\",\"ü\"))","v":""},{"$f":"IF(M15=\"\",\"\",M15/10)","v":""}]
[null,null,{"$f":"IF(OR($M$11=\"\",$M$13=\"\",),\"\",\"Das maximale Maß für A beträgt:\")","v":""},null,null,null,null,null,null,null,null,{"$f":"IF(M16=\"\",\"\",\"mm\")","v":""},{"$f":"IF(C16=\"\",\"\",Calc!C9)","v":""},null,null,null,{"$f":"IF(M16=\"\",\"\",INT(M16/10))","v":""}]
[]
[null,null,null,null,null,null,null,null,null,null,null,null,null,null,null,null,null,null,"Besondere Hinweise zu Ihrer Berechnung:"]
[null,{"$f":"IF(M19=\"\",\"\",\"X\")","v":""},{"$f":"IF(M19=\"\",IF(M15>M16,\"Ihr gewählter Abstand A ist größer als zulässig!\",\"\"),\"Die erforderliche Länge über Dachkante beträgt\")","v":""},null,null,null,null,null,null,null,null,null,{"$f":"IF(AND(Calc!F11=\"Flachdach\",M11>0),Calc!C34,IF(OR($M$11=\"\",$M$13=\"\",$M$15=\"\",Calc!$F$21=0),\"\",Calc!C34))","v":""},null,null,{"$f":"IF(M19=\"\",\"\",\"mm\")","v":""},null,null,{"$f":"IF(Calc!$F$21=0,\"\",Calc!G45)","v":""}]
[null,{"$f":"IF(AND(Calc!F11=\"Flachdach\",M11>0),\"Diese Länge gilt für jeden Montageort an allen Gebäudeseiten\",\"\")","v":""}]
[null,{"$f":"IF(OR(M19<4500,Calc!F21=0),\"\",\"Diese freistehende Länge ist kein Standard.\"&CHAR(10)&\"Bitte nehmen Sie Kontakt mit uns auf - wir finden eine Lösung.\")","v":""}]
[]
[null,{"$f":"IF(Calc!F11=\"Flachdach\",\"\",IF(Calc!F21=0,\"\",\"alternative Baulängen\"))","v":""}]
[null,{"$f":"IF(Calc!F11=\"Flachdach\",\"\",IF(Calc!F21=0,\"\",\"Abstand A [mm]\"))","v":""},null,null,null,null,{"$f":"IF(Calc!$F$21=0,\"\",Calc!H24)","v":""},{"$f":"IF(Calc!$F$21=0,\"\",Calc!I24)","v":""},{"$f":"IF(Calc!$F$21=0,\"\",Calc!J24)","v":""},{"$f":"IF(Calc!$F$21=0,\"\",Calc!K24)","v":""},{"$f":"IF(Calc!$F$21=0,\"\",Calc!L24)","v":""},{"$f":"IF(Calc!$F$21=0,\"\",Calc!M24)","v":""},{"$f":"IF(Calc!$F$21=0,\"\",Calc!N24)","v":""},{"$f":"IF(Calc!$F$21=0,\"\",Calc!O24)","v":""},{"$f":"IF(Calc!$F$21=0,\"\",Calc!P24)","v":""},{"$f":"IF(Calc!$F$21=0,\"\",Calc!Q24)","v":""},{"$f":"IF(Calc!$F$21=0,\"\",Calc!R24)","v":""},{"$f":"IF(Calc!$F$21=0,\"\",Calc!S24)","v":""},{"$f":"IF(Calc!$F$21=0,\"\",Calc!T24)","v":""},{"$f":"IF(Calc!$F$21=0,\"\",Calc!U24)","v":""},{"$f":"IF(Calc!$F$21=0,\"\",Calc!V24)","v":""},{"$f":"IF(Calc!$F$21=0,\"\",Calc!W24)","v":""},{"$f":"IF(Calc!$F$21=0,\"\",Calc!X24)","v":""},{"$f":"IF(Calc!$F$21=0,\"\",Calc!Y24)","v":""},{"$f":"IF(Calc!$F$21=0,\"\",Calc!Z24)","v":""},{"$f":"IF(Calc!$F$21=0,\"\",Calc!AA24)","v":""},{"$f":"IF(Calc!$F$21=0,\"\",Calc!AB24)","v":""},{"$f":"IF(Calc!$F$21=0,\"\",Calc!AC24)","v":""},{"$f":"IF(Calc!$F$21=0,\"\",Calc!AD24)","v":""},{"$f":"IF(Calc!$F$21=0,\"\",Calc!AE24)","v":""},{"$f":"IF(Calc!$F$21=0,\"\",Calc!AF24)","v":""},{"$f":"IF(Calc!$F$21=0,\"\",Calc!AG24)","v":""},{"$f":"IF(Calc!$F$21=0,\"\",Calc!AH24)","v":""}]
[null,{"$f":"IF(Calc!F11=\"Flachdach\",\"\",IF(Calc!F21=0,\"\",\"Länge X über Dachkante [mm]\"))","v":""},null,null,null,null,{"$f":"IF(G24=\"\",\"\",Calc!H34)","v":""},{"$f":"IF(H24=\"\",\"\",Calc!I34)","v":""},{"$f":"IF(I24=\"\",\"\",Calc!J34)","v":""},{"$f":"IF(J24=\"\",\"\",Calc!K34)","v":""},{"$f":"IF(K24=\"\",\"\",Calc!L34)","v":""},{"$f":"IF(L24=\"\",\"\",Calc!M34)","v":""},{"$f":"IF(M24=\"\",\"\",Calc!N34)","v":""},{"$f":"IF(N24=\"\",\"\",Calc!O34)","v":""},{"$f":"IF(O24=\"\",\"\",Calc!P34)","v":""},{"$f":"IF(P24=\"\",\"\",Calc!Q34)","v":""},{"$f":"IF(Q24=\"\",\"\",Calc!R34)","v":""},{"$f":"IF(R24=\"\",\"\",Calc!S34)","v":""},{"$f":"IF(S24=\"\",\"\",Calc!T34)","v":""},{"$f":"IF(T24=\"\",\"\",Calc!U34)","v":""},{"$f":"IF(U24=\"\",\"\",Calc!V34)","v":""},{"$f":"IF(V24=\"\",\"\",Calc!W34)","v":""},{"$f":"IF(W24=\"\",\"\",Calc!X34)","v":""},{"$f":"IF(X24=\"\",\"\",Calc!Y34)","v":""},{"$f":"IF(Y24=\"\",\"\",Calc!Z34)","v":""},{"$f":"IF(Z24=\"\",\"\",Calc!AA34)","v":""},{"$f":"IF(AA24=\"\",\"\",Calc!AB34)","v":""},{"$f":"IF(AB24=\"\",\"\",Calc!AC34)","v":""},{"$f":"IF(AC24=\"\",\"\",Calc!AD34)","v":""},{"$f":"IF(AD24=\"\",\"\",Calc!AE34)","v":""},{"$f":"IF(AE24=\"\",\"\",Calc!AF34)","v":""},{"$f":"IF(AF24=\"\",\"\",Calc!AG34)","v":""},{"$f":"IF(AG24=\"\",\"\",Calc!AH34)","v":""}]
[]
[null,{"$f":"IF(G27=\"\",\"\",\"Abstand A [mm]\")","v":""},null,null,null,null,{"$f":"IF(Calc!$F$21=0,\"\",Calc!AI24)","v":""},{"$f":"IF(Calc!$F$21=0,\"\",Calc!AJ24)","v":""},{"$f":"IF(Calc!$F$21=0,\"\",Calc!AK24)","v":""},{"$f":"IF(Calc!$F$21=0,\"\",Calc!AL24)","v":""},{"$f":"IF(Calc!$F$21=0,\"\",Calc!AM24)","v":""},{"$f":"IF(Calc!$F$21=0,\"\",Calc!AN24)","v":""},{"$f":"IF(Calc!$F$21=0,\"\",Calc!AO24)","v":""},{"$f":"IF(Calc!$F$21=0,\"\",Calc!AP24)","v":""},{"$f":"IF(Calc!$F$21=0,\"\",Calc!AQ24)","v":""},{"$f":"IF(Calc!$F$21=0,\"\",Calc!AR24)","v":""},{"$f":"IF(Calc!$F$21=0,\"\",Calc!AS24)","v":""},{"$f":"IF(Calc!$F$21=0,\"\",Calc!AT24)","v":""},{"$f":"IF(Calc!$F$21=0,\"\",Calc!AU24)","v":""},{"$f":"IF(Calc!$F$21=0,\"\",Calc!AV24)","v":""},{"$f":"IF(Calc!$F$21=0,\"\",Calc!AW24)","v":""},{"$f":"IF(Calc!$F$21=0,\"\",Calc!AX24)","v":""},{"$f":"IF(Calc!$F$21=0,\"\",Calc!AY24)","v":""},{"$f":"IF(Calc!$F$21=0,\"\",Calc!AZ24)","v":""},{"$f":"IF(Calc!$F$21=0,\"\",Calc!BA24)","v":""},{"$f":"IF(Calc!$F$21=0,\"\",Calc!BB24)","v":""},{"$f":"IF(Calc!$F$21=0,\"\",Calc!BC24)","v":""},{"$f":"IF(Calc!$F$21=0,\"\",Calc!BD24)","v":""},{"$f":"IF(Calc!$F$21=0,\"\",Calc!BE24)","v":""},{"$f":"IF(Calc!$F$21=0,\"\",Calc!BF24)","v":""},{"$f":"IF(Calc!$F$21=0,\"\",Calc!BG24)","v":""},{"$f":"IF(Calc!$F$21=0,\"\",Calc!BH24)","v":""},{"$f":"IF(Calc!$F$21=0,\"\",Calc!BI24)","v":""}]
[null,{"$f":"IF(G27=\"\",\"\",\"Länge X über Dachkante [mm]\")","v":""},null,null,null,null,{"$f":"IF(G24=\"\",\"\",Calc!AI34)","v":""},{"$f":"IF(H24=\"\",\"\",Calc!AJ34)","v":""},{"$f":"IF(I24=\"\",\"\",Calc!AK34)","v":""},{"$f":"IF(J24=\"\",\"\",Calc!AL34)","v":""},{"$f":"IF(K24=\"\",\"\",Calc!AM34)","v":""},{"$f":"IF(L24=\"\",\"\",Calc!AN34)","v":""},{"$f":"IF(M24=\"\",\"\",Calc!AO34)","v":""},{"$f":"IF(N24=\"\",\"\",Calc!AP34)","v":""},{"$f":"IF(O24=\"\",\"\",Calc!AQ34)","v":""},{"$f":"IF(P24=\"\",\"\",Calc!AR34)","v":""},{"$f":"IF(Q24=\"\",\"\",Calc!AS34)","v":""},{"$f":"IF(R24=\"\",\"\",Calc!AT34)","v":""},{"$f":"IF(S24=\"\",\"\",Calc!AU34)","v":""},{"$f":"IF(T24=\"\",\"\",Calc!AV34)","v":""},{"$f":"IF(U24=\"\",\"\",Calc!AW34)","v":""},{"$f":"IF(V24=\"\",\"\",Calc!AX34)","v":""},{"$f":"IF(W24=\"\",\"\",Calc!AY34)","v":""},{"$f":"IF(X24=\"\",\"\",Calc!AZ34)","v":""},{"$f":"IF(Y24=\"\",\"\",Calc!BA34)","v":""},{"$f":"IF(Z24=\"\",\"\",Calc!BB34)","v":""},{"$f":"IF(AA24=\"\",\"\",Calc!BC34)","v":""},{"$f":"IF(AB24=\"\",\"\",Calc!BD34)","v":""},{"$f":"IF(AC24=\"\",\"\",Calc!BE34)","v":""},{"$f":"IF(AD24=\"\",\"\",Calc!BF34)","v":""},{"$f":"IF(AE24=\"\",\"\",Calc!BG34)","v":""},{"$f":"IF(AF24=\"\",\"\",Calc!BH34)","v":""},{"$f":"IF(AG24=\"\",\"\",Calc!BI34)","v":""}]
[]
[null,null,null,null,null,null,null,null,null,null,null,null,null,null,null,null,null,null,null,null,null,null,null,null,null,null,null,null,null,null,null,null,"Version: 2.6 / 10.08.2022"]

{"sheet":"Calc","index":2,"n_rows":45,"n_cols":61,"rows_kept":45,"cut":false,"hidden":true,"merged":[]}
[null,null,null,null,null,"Dachformen"]
[null,"Toleranzwert",1,"mm",null,"Satteldach (symmetrisch)"]
[null,"Mindestlänge Rohr",400,"mm",null,"Pultdach"]
[null,"Dachneigung max",65,"°",null,"Flachdach"]
[]
[null,"Breite Dach",{"$f":"IF(Frontend!M11=\"\",\"\",Frontend!M11*C8)","v":""},"mm"]
[1,"Breite Dachseite",{"$f":"IF(C6=\"\",\"\",C6/2)","v":""},"mm"]
[null,"Faktor Dachbreite (Pult)",{"$f":"IF(F11=\"Pultdach\",2,1)","v":1}]
[null,"Amax",{"$f":"IF(C7=\"\",\"\",C7/2-C2)","v":""},"mm"]
[2,"A gewählt",{"$f":"IF(Frontend!M15=\"\",\"\",Frontend!M15)","v":""},"mm",null,"Dachform gewählt"]
[null,null,null,null,null,""]
[null,"Dachneigung ist",{"$f":"IF(F11=\"Flachdach\",0,IF(Frontend!M13=\"\",\"\",Frontend!M13))","v":""},"°"]
[null,"Dachneigung soll",20,"°"]
[]
[3,"Firsthöhe ist",{"$f":"IF(F21=0,\"\",C7*TAN(C12/180*PI()))","v":""}]
[4,"Firsthöhe soll",{"$f":"IF(F21=0,\"\",C7*TAN(C13/180*PI()))","v":""},null,"Berechnung zulässig (ohne Flachdach)",{"$f":"IF(OR(C6=\"\",C12=\"\",C10>C9,C12>C4,F11=\"\"),0,1)","v":0}]
[null,"Differenz Firsthöhe",{"$f":"IF(F21=0,\"\",IF(C12<C13,C16-C15,0))","v":""},null,"Berechnung zulässig (Flachdach)",{"$f":"IF(F11=\"Flachdach\",IF(C6=\"\",0,1),0)","v":0}]
[]
[null,"Diff Dachkante First"]
[null,"Diff Dachkante First ist"]
[null,null,null,null,"Berechnung zulässig",{"$f":"MAX(F16:F17)","v":0}]
[]
[]
[null,null,null,null,"Firstabstand",null,"[2]",{"$f":"IF(F11=\"Flachdach\",\"\",IF(F21=0,\"\",0))","v":""},{"$f":"IF(H24=\"\",\"\",IF(H24+100<$C$9,H24+100,\"\"))","v":""},"","","","","","","","","","","","","","","","","","","","","","","","","","","","","","","",{"$f":"IF(AN24=\"\",\"\",IF(AN24+100<$C$9,AN24+100,\"\"))","v":""},"","","","","","","","","","","","","","","","","","","",""]
[null,null,null,null,"Dachneigung < 20 Grad"]
[null,"Höhe Dachkante ist",{"$f":"IF(F11=\"Flachdach\",0,IF(F21=0,\"\",($C$7-C10)*TAN($C$12/180*PI())))","v":""},null,"Höhe Dachkante ist",null,"[5]",{"$f":"IF(H24=\"\",\"\",($C$7-H24)*TAN($C$12/180*PI()))","v":""},"","","","","","","","","","","","","","","","","","","","","","","","","","","","","","","",{"$f":"IF(AN24=\"\",\"\",($C$7-AN24)*TAN($C$12/180*PI()))","v":""},"","","","","","","","","","","","","","","","","","","","",""]
[null,"Höhe Dachkante soll",{"$f":"IF(F11=\"Flachdach\",0,IF(F21=0,\"\",($C$7-C10)*TAN($C$13/180*PI())))","v":""},null,"Höhe Dachkante soll",null,"[6]",{"$f":"IF(H24=\"\",\"\",($C$7-H24)*TAN($C$13/180*PI()))","v":""},"","","","","","","","","","","","","","","","","","","","","","","","","","","","","","","",{"$f":"IF(AN24=\"\",\"\",($C$7-AN24)*TAN($C$13/180*PI()))","v":""},"","","","","","","","","","","","","","","","","","","","",""]
[]
[null,"Differenz Dachkante zu Soll",{"$f":"IF(F21=0,\"\",IF($C$12<$C$13,C27-C26,0))","v":""},null,"Differenz Dachkante zu Soll",null,null,{"$f":"IF(H24=\"\",\"\",IF($C$12<$C$13,H27-H26,0))","v":""},"","","","","","","","","","","","","","","","","","","","","","","","","","","","","","","",{"$f":"IF(AN24=\"\",\"\",IF($C$12<$C$13,AN27-AN26,0))","v":""},"","","","","","","","","","","","","","","","","","","","",""]
[]
[null,"Länge Rohr bis First",{"$f":"IF(F11=\"Flachdach\",C16,IF(F21=0,\"\",IF($C$12>=$C$13,C10*TAN($C$12/180*PI()),C10*TAN($C$13/180*PI()))))","v":""},null,"Länge Rohr bis First",null,null,{"$f":"IF(H24=\"\",\"\",IF($C$12>=$C$13,H24*TAN($C$12/180*PI()),H24*TAN($C$13/180*PI())))","v":""},"","","","","","","","","","","","","","","","","","","","","","","","","","","","","","","",{"$f":"IF(AN24=\"\",\"\",IF($C$12>=$C$13,AN24*TAN($C$12/180*PI()),AN24*TAN($C$13/180*PI())))","v":""},"","","","","","","","","","","","","","","","","","","","",""]
[null,"Mindestlänge Rohr über First",{"$f":"IF(F11=\"Flachdach\",C3,IF(F21=0,\"\",IF($C$3+$C$2<C10,C10+$C$2,$C$3+$C$2)))","v":""},null,"Mindestlänge Rohr über First",null,null,{"$f":"IF(H24=\"\",\"\",IF($C$3+$C$2<C10,$C$3+$C$2,H24+$C$2))","v":""},"","","","","","","","","","","","","","","","","","","","","","","","","","","","","","","",{"$f":"IF(AN24=\"\",\"\",IF($C$3+$C$2<AI10,$C$3+$C$2,AN24+$C$2))","v":""},"","","","","","","","","","","","","","","","","","","","",""]
[]
[null,"Länge Rohr erforderlich",{"$f":"IF(F11=\"Flachdach\",C31+C32,IF(F21=0,\"\",C32+C31+C29))","v":""},null,"Länge Rohr",null,null,{"$f":"IF(H24=\"\",\"\",H32+H31+H29)","v":""},"","","","","","","","","","","","","","","","","","","","","","","","","","","","","","","",{"$f":"IF(AN24=\"\",\"\",AN32+AN31+AN29)","v":""},"","","","","","","","","","","","","","","","","","","","",""]
[]
[]
[null,null,null,null,null,"Hinweistexte"]
[null,null,null,null,null,"Flachdach",{"$f":"IF(C12<C13,\"*Die Schornsteinlänge wird auf Basis Dachneigung=20° ermittelt (Mindestneigung)\",\"\")","v":""}]
[null,null,null,null,null,"Flachdach Giebelseite",{"$f":"IF(AND(C12<C13,F11=\"Flachdach\"),\"*Diese Berechnung erfolgt NICHT nach BImSchV - es kommt VDI 3781 Blatt 4 zur Anwendung!\",\"\")","v":""}]
[null,null,null,null,null,"Flachdach Alternative VDI"]
[null,null,null,null,null,"Pultdach",{"$f":"IF(F11=\"Pultdach\",\"*Bei einem Pultdach dürfen Sie entlang der gesamten Giebelseite montieren\",\"\")","v":""}]
[]
[]
[]
[null,null,null,null,null,null,{"$f":"G38&CHAR(10)&G39&CHAR(10)&G40&CHAR(10)&G41&CHAR(10)","v":"\n\n\n\n"}]

{"sheet":"Änderungshistorie","index":3,"n_rows":11,"n_cols":3,"rows_kept":11,"cut":false,"hidden":true,"merged":[]}
["0.9","2021-10-10","Erstversion"]
["0.9.1","2021-10-12","*Umbenennung L zu X\n*Entfernung Rohrdurchmesser, Mass A bis Mittellinie geplanter Schornstein\n* \"Der maximal zulässige Montageabstand (D) vom First beträgt:\" ersetzt durch \"Das maximale Maß für A beträgt:\"\n* Keine Berechnungen bei Dächern < 20 Grad"]
["0.9.2","2021-10-13","*Formel G22:AZ22 korrigiert"]
["1.0","2021-10-14","*Abfrage Speichern bei Beenden verhindern\n*Hinweis zur Aktivierung der Makros"]
["1.0.1","2021-10-17","*Fußzeile Heike hinzugefügt\n*Erweiterung der Tabelle bis zum rechten Rand"]
["1.1","2021-10-22","*Auswahl Dachform eingefügt\n*Frontend: \"Länge L\" zu \"Länge X\"\n*Datum des Inkrafttretens"]
["2.0","2021-10-25","*Berechnung komplett neu und vereinfacht\n-Fehler Flach-/Pultdach < 20°"]
["2.4","2021-11-09","*Kopierschutz für Einzelplatz\n*Grafiken angepasst (Dachneigung bei < 20 Grad\n*cm als \"Vergleichsmaß\" dargestellt"]
["2.5","2021-11-10","*Maß x in der Darstellung entfernt\n*Tabellenreister ausgeblendet\n*keine Fehlerbehebungen"]
["2.5.4","2021-11-19","Fehler Pultdach korrigiert"]
["2.6","2022-08-10","Änderung der Berechnung Flachdach: VDI 3781 Blatt 4 / 6.2.1.2.3"]

{"sheet":"Test","index":4,"n_rows":0,"n_cols":0,"rows_kept":0,"cut":false,"hidden":true,"merged":[]}